﻿"Item Id","Item URI","Dublin Core:Title","Dublin Core:Subject","Dublin Core:Description","Dublin Core:Creator","Dublin Core:Source","Dublin Core:Publisher","Dublin Core:Date","Dublin Core:Contributor","Dublin Core:Rights","Dublin Core:Relation","Dublin Core:Format","Dublin Core:Language","Dublin Core:Type","Dublin Core:Identifier","Dublin Core:Coverage","Item Type Metadata:Text","Item Type Metadata:Interviewer","Item Type Metadata:Interviewee","Item Type Metadata:Location","Item Type Metadata:Transcription","Item Type Metadata:Local URL","Item Type Metadata:Original Format","Item Type Metadata:Physical Dimensions","Item Type Metadata:Duration","Item Type Metadata:Compression","Item Type Metadata:Producer","Item Type Metadata:Director","Item Type Metadata:Bit Rate/Frequency","Item Type Metadata:Time Summary","Item Type Metadata:Email Body","Item Type Metadata:Subject Line","Item Type Metadata:From","Item Type Metadata:To","Item Type Metadata:CC","Item Type Metadata:BCC","Item Type Metadata:Number of Attachments","Item Type Metadata:Standards","Item Type Metadata:Objectives","Item Type Metadata:Materials","Item Type Metadata:Lesson Plan Text","Item Type Metadata:URL","Item Type Metadata:Event Type","Item Type Metadata:Participants","Item Type Metadata:Birth Date","Item Type Metadata:Birthplace","Item Type Metadata:Death Date","Item Type Metadata:Occupation","Item Type Metadata:Biographical Text","Item Type Metadata:Bibliography",Scripto:Transcription,tags,file,itemType,collection,public,featured
6729,https://proyectoarde.org/items/show/6729,"Cinco fotografías dúo de la coreografía ""Gente""","Danza moderna, Artes escénicas, Danza Chile","Fotografías de ""Gente"", Ballet Municipal de Cámara de Valdivia y coreografía de Ricardo Uribe. Estrenada para la 13° versión del Festival de Danza Contemporánea. En las imágenes, Ximena Schaaf en dúo con Alex Jaque.","Miguel Ángel Bustos","Archivo personal Ximena Shaaf^^Miguel Ángel Bustos",ARDE,2022,"Constanza Alvarado","Esta obra está bajo una Licencia Creative Commons Atribución-NoComercial 4.0 Internacional.",,JPG,,Imagen,,"Chile, Región de Los Ríos, Valdivia",,,,,,,,,,,,,,,,,,,,,,,,,,,,,,,,,,,,,"https://s3.sa-east-1.amazonaws.com/ardeomeka/original/6b378e1f1061e0925c713de2429bdd6d.JPG?AWSAccessKeyId=AKIA2OVYM46UCGCAAWEM&Expires=1720204800&Signature=YFQSq10wP4rqZa%2FJIxcPzZkI%2FRE%3D,https://s3.sa-east-1.amazonaws.com/ardeomeka/original/f91a4001d5405aea2dc18114ae0aefd6.JPG?AWSAccessKeyId=AKIA2OVYM46UCGCAAWEM&Expires=1720204800&Signature=CyVThDazRFZM0jQfrktc7i4g6Yg%3D,https://s3.sa-east-1.amazonaws.com/ardeomeka/original/33142582c9579f1ed7f918af71f18299.JPG?AWSAccessKeyId=AKIA2OVYM46UCGCAAWEM&Expires=1720204800&Signature=uCF8MxvfJ6a0ohWtaXmhnvwKjyI%3D,https://s3.sa-east-1.amazonaws.com/ardeomeka/original/5826b82c6dc57aca7709605cf893334f.JPG?AWSAccessKeyId=AKIA2OVYM46UCGCAAWEM&Expires=1720204800&Signature=l2U6zUlBZc3exeOllk2KbAqqLLQ%3D,https://s3.sa-east-1.amazonaws.com/ardeomeka/original/4a380b9def19493160bcc6cff395a81b.JPG?AWSAccessKeyId=AKIA2OVYM46UCGCAAWEM&Expires=1720204800&Signature=Uxjm6RqolaPA%2BRWu24uSbz%2FDdGk%3D",,"Ximena Shaaf Álvarez",1,0
6728,https://proyectoarde.org/items/show/6728,"Cuatro fotografías dúo de la coreografía ""Gente""","Danza moderna, Artes escénicas, Danza Chile","Fotografías de ""Gente"", Ballet Municipal de Cámara de Valdivia y coreografía de Ricardo Uribe. Estrenada para la 13° versión del Festival de Danza Contemporánea. En las imágenes, Ximena Schaaf en dúo con Alex Jaque.","Miguel Ángel Bustos","Archivo personal Ximena Shaaf^^Miguel Ángel Bustos",ARDE,2022,"Constanza Alvarado","Esta obra está bajo una Licencia Creative Commons Atribución-NoComercial 4.0 Internacional.",,JPG,,Imagen,,"Chile, Región de Los Ríos, Valdivia",,,,,,,,,,,,,,,,,,,,,,,,,,,,,,,,,,,,,"https://s3.sa-east-1.amazonaws.com/ardeomeka/original/2b5e6e6f0ca8d89be55c4494a6fe4a26.JPG?AWSAccessKeyId=AKIA2OVYM46UCGCAAWEM&Expires=1720204800&Signature=dXHnMHg%2FtFiTtPAxrM5PkXngVXQ%3D,https://s3.sa-east-1.amazonaws.com/ardeomeka/original/b33db260dbe90f8c6dab7adfd193654e.JPG?AWSAccessKeyId=AKIA2OVYM46UCGCAAWEM&Expires=1720204800&Signature=33HLPGTY161m2zvpBuUx3NIdb2Y%3D,https://s3.sa-east-1.amazonaws.com/ardeomeka/original/4ff838dda788d0e99b0cf7d54a9b52e2.JPG?AWSAccessKeyId=AKIA2OVYM46UCGCAAWEM&Expires=1720204800&Signature=l4LtPMK5FlquMklql3HgrnOOuqY%3D,https://s3.sa-east-1.amazonaws.com/ardeomeka/original/5b8ab5792f047b6e30db9160208725dc.JPG?AWSAccessKeyId=AKIA2OVYM46UCGCAAWEM&Expires=1720204800&Signature=MjcPpgp80UVnzOuYIXzPQT53qB0%3D",,"Ximena Shaaf Álvarez",1,1
6727,https://proyectoarde.org/items/show/6727,"Fotografía entrega Diplomado en Pedagogía Teatral UC","Artes escénicas, teatro de figuras, teatro contemporáneo","Fotografía realizada a Marcela Cornejo para su obtención del Diplomado en Pedagogía Teatral de la Pontificia Universidad Católica de Chile. En la imagen la actriz aparece junto a Verónica García Huidobro a su izquierda, y Ana María Allendes a su derecha. Cornejo declara que ambas mujeres han sido referentes fundamentales en su trayectoria. Ana María Allendes como una maestra que la introdujo al conocimiento del mundo de los títeres y marionetas: ""Yo digo que ella es mi madrina"", señala la actriz. Verónica García-Huidobro como referente y maestra en el campo de la pedagogía teatral.","Diplomado en Pedagogía Teatral de la Pontificia Universidad Católica de Chile","Archivo personal Marcela Cornejo Gómez",ARDE,2004,"Constanza Alvarado","Esta obra está bajo una Licencia Creative Commons Atribución-NoComercial 4.0 Internacional.",,JPG,Español,"Imagen, texto",,"Chile, Región Metropolitana, Santiago",,,,,,,,,,,,,,,,,,,,,,,,,,,,,,,,,,,,,https://s3.sa-east-1.amazonaws.com/ardeomeka/original/a3ade403fe8b3d7f8ac5af6c96849fc3.jpg?AWSAccessKeyId=AKIA2OVYM46UCGCAAWEM&Expires=1720204800&Signature=D8R0%2BZPH2JYLZlD4YHz9mpwjxzA%3D,,"Marcela Cornejo Gómez",1,0
6722,https://proyectoarde.org/items/show/6722,"Ensayo de obra Ivanov.","Diseño teatral","16 fotografías de un ensayo de Ivanov en Teatro la Memoria. En ellas se puede ver parte de la escenografía, el vestuario y la iluminación diseñana dpor Catalina Devia para esta obra dirigida por Rodrigo Pérez. En ellas los actores y actrices: Cristian carvajal, Jaime leiva, Marcela MIllie, Carolina Jullian, Marco rebolledo y Johnatan Inostroza.","Carolina Jullian","Archivo personal de Catalina Devia",ARDE,2021,"Pía Gutiérrez","Esta obra está bajo una Licencia Creative Commons Atribución-NoComercial 4.0 Internacional.","Teatro La Provincia",jpg,"No aplica",Fotografía,"No aplica","Sin información",,,,,,,,,,,,,,,,,,,,,,,,,,,,,,,,,,,,,https://s3.sa-east-1.amazonaws.com/ardeomeka/original/83b633aba9ff51d6ee362ebebcecb6f4.jpeg?AWSAccessKeyId=AKIA2OVYM46UCGCAAWEM&Expires=1720204800&Signature=hvn6%2BRcDsmgY8WWogN0NQIj%2FGy4%3D,Dataset,"Catalina Devia Garrido",1,0
6721,https://proyectoarde.org/items/show/6721,"Cortinas de cotillón, parte del diseño espacial de Ivanov.","Diseño teatral","Fotografía de cortinas de cotillón dorado usadas en la escenografía de Ivanov por Catalina Devia.","Carolina Jullian","Archivo personal de Catalina Devia",ARDE,2021,"Pía Gutiérrez","Esta obra está bajo una Licencia Creative Commons Atribución-NoComercial 4.0 Internacional.","Teatro La Provincia",jpg,"No aplica",Fotografía,"No aplica","Sin información",,,,,,,,,,,,,,,,,,,,,,,,,,,,,,,,,,,,,https://s3.sa-east-1.amazonaws.com/ardeomeka/original/bae99fd6a59e69f079d2c114f5ed2dd6.jpeg?AWSAccessKeyId=AKIA2OVYM46UCGCAAWEM&Expires=1720204800&Signature=ImZtQZdoORWhPQqz%2Bgqzf%2FBKSdU%3D,Dataset,"Catalina Devia Garrido",1,0
6720,https://proyectoarde.org/items/show/6720,"Fotografías promoción de la obra Ivanov","Diseño teatral","31 fotografías del elenco de Ivanov, recreando diferentes situaciones con vestuario y en el escenario del Teatro la Memoria para la promoción de la obra dirigida por Rodrigo Pérez y diseñada por Catalina Devia. En ellas: Cristián Carvajal, Catalina Saavedra, Marcela Millie, Aplir Gregory, Jaime Leiva, Verónica Medel, Marco Rebolledo, Eduardo Herrera, Macarena Lagos, Johnatan Inostroza y Guillermo Ugalde.","Carolina Jullian","Archivo personal de Catalina Devia",ARDE,2021,"Pía Gutiérrez","Esta obra está bajo una Licencia Creative Commons Atribución-NoComercial 4.0 Internacional.","Teatro La Provincia",jpg,"No aplica",Fotografía,"No aplica","Sin información",,,,,,,,,,,,,,,,,,,,,,,,,,,,,,,,,,,,,https://s3.sa-east-1.amazonaws.com/ardeomeka/original/c166c185d8aaf23d4a8a83b9eb2cafba.pdf?AWSAccessKeyId=AKIA2OVYM46UCGCAAWEM&Expires=1720204800&Signature=dlaVMMpwKJSnFDN628wO14sfQdg%3D,Dataset,"Catalina Devia Garrido",1,0
6719,https://proyectoarde.org/items/show/6719,,"Diseño teatral","2 fotografías del actor Guillermo Ugalde. Imágenes promocionales de Ivanov dirigida por Rodrigo Pérez y diseñada por Catalina Devia.","Carolina Jullian","Archivo personal de Catalina Devia",ARDE,2021,"Pía Gutiérrez","Esta obra está bajo una Licencia Creative Commons Atribución-NoComercial 4.0 Internacional.","Teatro La Provincia",jpg,"No aplica",Fotografía,"No aplica","Sin información",,,,,,,,,,,,,,,,,,,,,,,,,,,,,,,,,,,,,https://s3.sa-east-1.amazonaws.com/ardeomeka/original/a20cb0e8ab3fae49a12f332b5e3a59e8.pdf?AWSAccessKeyId=AKIA2OVYM46UCGCAAWEM&Expires=1720204800&Signature=pUtAuiR50UM1LndnaEMsXSGN6DI%3D,Dataset,"Catalina Devia Garrido",1,0
6718,https://proyectoarde.org/items/show/6718,,"Diseño teatral","2 fotografías del actor Marco Rebolledo. Imágenes promocionales de Ivanov dirigida por Rodrigo Pérez y diseñada por Catalina Devia","Carolina Jullian","Archivo personal de Catalina Devia",ARDE,2021,"Pía Gutiérrez","Esta obra está bajo una Licencia Creative Commons Atribución-NoComercial 4.0 Internacional.","Teatro La Provincia",jpg,"No aplica",Fotografía,"No aplica","Sin información",,,,,,,,,,,,,,,,,,,,,,,,,,,,,,,,,,,,,https://s3.sa-east-1.amazonaws.com/ardeomeka/original/dbc1a5552f0e863fd7f6e748fc2cf5db.pdf?AWSAccessKeyId=AKIA2OVYM46UCGCAAWEM&Expires=1720204800&Signature=lMdd5cwhgAb9zt%2B%2FtYfC54018BM%3D,Dataset,"Catalina Devia Garrido",1,0
6717,https://proyectoarde.org/items/show/6717,,"Diseño teatral","6 fotografías de Cristian Carvajal como el personaje Ivanov en la obra homónima dirigida por Rodrigo Pérez y diseñana por Catalina Devia.","Carolina Jullian","Archivo personal de Catalina Devia",ARDE,2021,"Pía Gutiérrez","Esta obra está bajo una Licencia Creative Commons Atribución-NoComercial 4.0 Internacional.","Teatro La Provincia",jpg,"No aplica",Fotografía,"No aplica","Sin información",,,,,,,,,,,,,,,,,,,,,,,,,,,,,,,,,,,,,https://s3.sa-east-1.amazonaws.com/ardeomeka/original/27a869aed98168728f45fb9a4c7f5995.pdf?AWSAccessKeyId=AKIA2OVYM46UCGCAAWEM&Expires=1720204800&Signature=WqFMBtFRDh8SfZeX986GaByokUM%3D,Dataset,"Catalina Devia Garrido",1,0
6716,https://proyectoarde.org/items/show/6716,,"Diseño teatral","6 fotografías del actor Johnatan Inostroza en Ivanov dirigida por Rodrigo Pérez y diseñada por Catalina Devia.","Carolina Jullian","Archivo personal de Catalina Devia",ARDE,2021,"Pía Gutiérrez","Esta obra está bajo una Licencia Creative Commons Atribución-NoComercial 4.0 Internacional.","Teatro La Provincia",jpg,"No aplica",Fotografía,"No aplica","Sin información",,,,,,,,,,,,,,,,,,,,,,,,,,,,,,,,,,,,,https://s3.sa-east-1.amazonaws.com/ardeomeka/original/32b435c9e536cd636f501b60ba7c581b.pdf?AWSAccessKeyId=AKIA2OVYM46UCGCAAWEM&Expires=1720204800&Signature=zdqDgob2S%2FA4y%2BEQ32Vqo5H9iWM%3D,Dataset,"Catalina Devia Garrido",1,0
6715,https://proyectoarde.org/items/show/6715,,"Diseño teatral","3 fotografías del actor Jaime Leiva en Ivanov, dirigida por Rodrigo Pérez y diseñada por Catalina Devia.","Carolina Jullian","Archivo personal de Catalina Devia",ARDE,2021,"Pía Gutiérrez","Esta obra está bajo una Licencia Creative Commons Atribución-NoComercial 4.0 Internacional.","Teatro La Provincia",jpg,"No aplica",Fotografía,"No aplica","Sin información",,,,,,,,,,,,,,,,,,,,,,,,,,,,,,,,,,,,,https://s3.sa-east-1.amazonaws.com/ardeomeka/original/d4c9f0caf78cbc2dd32a103c6eee2b42.pdf?AWSAccessKeyId=AKIA2OVYM46UCGCAAWEM&Expires=1720204800&Signature=fI2QPKdqMl%2F4sg1sC0VKeeJN30k%3D,Dataset,"Catalina Devia Garrido",1,0
6714,https://proyectoarde.org/items/show/6714,"Anna para la obra Ivanov","Diseño teatral","5 fotografías de Marcela Mille en el personaje de Anna en Ivanov, dirección de Rodrigo Pérez y diseño de Catalina Devia.","Carolina Jullian","Archivo personal de Catalina Devia",ARDE,2021,"Pía Gutiérrez","Esta obra está bajo una Licencia Creative Commons Atribución-NoComercial 4.0 Internacional.","Teatro La Provincia",jpg,"No aplica",Fotografía,"No aplica","Sin información",,,,,,,,,,,,,,,,,,,,,,,,,,,,,,,,,,,,,https://s3.sa-east-1.amazonaws.com/ardeomeka/original/eefc463180dac98abf2cc308345c6087.pdf?AWSAccessKeyId=AKIA2OVYM46UCGCAAWEM&Expires=1720204800&Signature=IGp7V1t7nNhT6ALHpmVPKLrKAAc%3D,Dataset,"Catalina Devia Garrido",1,0
