﻿"Item Id","Item URI","Dublin Core:Title","Dublin Core:Subject","Dublin Core:Description","Dublin Core:Creator","Dublin Core:Source","Dublin Core:Publisher","Dublin Core:Date","Dublin Core:Contributor","Dublin Core:Rights","Dublin Core:Relation","Dublin Core:Format","Dublin Core:Language","Dublin Core:Type","Dublin Core:Identifier","Dublin Core:Coverage","Item Type Metadata:Text","Item Type Metadata:Interviewer","Item Type Metadata:Interviewee","Item Type Metadata:Location","Item Type Metadata:Transcription","Item Type Metadata:Local URL","Item Type Metadata:Original Format","Item Type Metadata:Physical Dimensions","Item Type Metadata:Duration","Item Type Metadata:Compression","Item Type Metadata:Producer","Item Type Metadata:Director","Item Type Metadata:Bit Rate/Frequency","Item Type Metadata:Time Summary","Item Type Metadata:Email Body","Item Type Metadata:Subject Line","Item Type Metadata:From","Item Type Metadata:To","Item Type Metadata:CC","Item Type Metadata:BCC","Item Type Metadata:Number of Attachments","Item Type Metadata:Standards","Item Type Metadata:Objectives","Item Type Metadata:Materials","Item Type Metadata:Lesson Plan Text","Item Type Metadata:URL","Item Type Metadata:Event Type","Item Type Metadata:Participants","Item Type Metadata:Birth Date","Item Type Metadata:Birthplace","Item Type Metadata:Death Date","Item Type Metadata:Occupation","Item Type Metadata:Biographical Text","Item Type Metadata:Bibliography",Scripto:Transcription,tags,file,itemType,collection,public,featured
4601,https://proyectoarde.org/items/show/4601,"Fotografía músicos montaje de A sangre 'e pato.","Álbum de fotos ","Fotografía análoga de los músicos del colectivo en el montaje de A sangre 'e pato. Parte posterior foto. Está escrito en lápiz de tinta blanco sobre papel negro. ""Un espectáculo en vértigo. ""A sangre 'e pato"" Colectivo artístico La Patogallina. La Perrera Arte. F. / Carola del Río.  ","Carola del Río",,,"Sin información",Arde,"La propiedad intelectual de este documento pertenece a sus autoras y autores. Contáctal@s para su uso.",,PDF,,dataset,cc29e20e-a489-4d3d-9c8e-2b02348fcf0d,,,,,,,,,,,,,,,,,,,,,,,,,,,,,,,,,,,,,,"https://arde-antiguo.s3-sa-east-1.amazonaws.com/foto1.pdf,https://arde-antiguo.s3-sa-east-1.amazonaws.com/foto1.1.pdf,https://arde-antiguo.s3-sa-east-1.amazonaws.com/foto2.pdf,https://arde-antiguo.s3-sa-east-1.amazonaws.com/foto2.1.pdf,https://arde-antiguo.s3-sa-east-1.amazonaws.com/foto3.pdf,https://arde-antiguo.s3-sa-east-1.amazonaws.com/foto3.1.pdf,https://arde-antiguo.s3-sa-east-1.amazonaws.com/foto4.pdf,https://arde-antiguo.s3-sa-east-1.amazonaws.com/foto4.1.pdf,https://arde-antiguo.s3-sa-east-1.amazonaws.com/foto5.pdf,https://arde-antiguo.s3-sa-east-1.amazonaws.com/foto5.1.pdf,https://arde-antiguo.s3-sa-east-1.amazonaws.com/foto6.pdf,https://arde-antiguo.s3-sa-east-1.amazonaws.com/foto6.1.pdf,https://arde-antiguo.s3-sa-east-1.amazonaws.com/foto7.pdf,https://arde-antiguo.s3-sa-east-1.amazonaws.com/foto7.1.pdf,https://arde-antiguo.s3-sa-east-1.amazonaws.com/foto8.pdf,https://arde-antiguo.s3-sa-east-1.amazonaws.com/foto8.1.pdf,https://arde-antiguo.s3-sa-east-1.amazonaws.com/foto9.pdf,https://arde-antiguo.s3-sa-east-1.amazonaws.com/foto9.1.pdf,https://arde-antiguo.s3-sa-east-1.amazonaws.com/foto10.pdf,https://arde-antiguo.s3-sa-east-1.amazonaws.com/foto10.1.pdf,https://arde-antiguo.s3-sa-east-1.amazonaws.com/foto11.pdf,https://arde-antiguo.s3-sa-east-1.amazonaws.com/foto11.1.pdf,https://arde-antiguo.s3-sa-east-1.amazonaws.com/foto12.pdf,https://arde-antiguo.s3-sa-east-1.amazonaws.com/foto12.1.pdf,https://arde-antiguo.s3-sa-east-1.amazonaws.com/foto13.pdf,https://arde-antiguo.s3-sa-east-1.amazonaws.com/foto13.1.pdf,https://arde-antiguo.s3-sa-east-1.amazonaws.com/foto14.pdf,https://arde-antiguo.s3-sa-east-1.amazonaws.com/foto14.1.pdf,https://arde-antiguo.s3-sa-east-1.amazonaws.com/foto15.pdf,https://arde-antiguo.s3-sa-east-1.amazonaws.com/foto15.1.pdf,https://arde-antiguo.s3-sa-east-1.amazonaws.com/foto16.pdf,https://arde-antiguo.s3-sa-east-1.amazonaws.com/foto16.1.pdf,https://arde-antiguo.s3-sa-east-1.amazonaws.com/foto17.pdf,https://arde-antiguo.s3-sa-east-1.amazonaws.com/foto17.1.pdf,https://arde-antiguo.s3-sa-east-1.amazonaws.com/foto18.pdf,https://arde-antiguo.s3-sa-east-1.amazonaws.com/foto18.1.pdf,https://arde-antiguo.s3-sa-east-1.amazonaws.com/foto19.pdf,https://arde-antiguo.s3-sa-east-1.amazonaws.com/foto19.1.pdf,https://arde-antiguo.s3-sa-east-1.amazonaws.com/foto20.pdf,https://arde-antiguo.s3-sa-east-1.amazonaws.com/foto20.1.pdf,https://arde-antiguo.s3-sa-east-1.amazonaws.com/foto21.pdf,https://arde-antiguo.s3-sa-east-1.amazonaws.com/foto21.1.pdf,https://arde-antiguo.s3-sa-east-1.amazonaws.com/foto22.pdf,https://arde-antiguo.s3-sa-east-1.amazonaws.com/foto22.1.pdf,https://arde-antiguo.s3-sa-east-1.amazonaws.com/foto23.pdf,https://arde-antiguo.s3-sa-east-1.amazonaws.com/foto23.1.pdf,https://arde-antiguo.s3-sa-east-1.amazonaws.com/foto24.pdf,https://arde-antiguo.s3-sa-east-1.amazonaws.com/foto24.1.pdf,https://arde-antiguo.s3-sa-east-1.amazonaws.com/foto25.pdf,https://arde-antiguo.s3-sa-east-1.amazonaws.com/foto25.1.pdf,https://arde-antiguo.s3-sa-east-1.amazonaws.com/foto26.pdf,https://arde-antiguo.s3-sa-east-1.amazonaws.com/foto26.1.pdf,https://arde-antiguo.s3-sa-east-1.amazonaws.com/foto27.pdf,https://arde-antiguo.s3-sa-east-1.amazonaws.com/foto27.1.pdf,https://arde-antiguo.s3-sa-east-1.amazonaws.com/foto28.pdf,https://arde-antiguo.s3-sa-east-1.amazonaws.com/foto28.1.pdf,https://arde-antiguo.s3-sa-east-1.amazonaws.com/foto29.pdf,https://arde-antiguo.s3-sa-east-1.amazonaws.com/foto29.1.pdf,https://arde-antiguo.s3-sa-east-1.amazonaws.com/foto30.pdf,https://arde-antiguo.s3-sa-east-1.amazonaws.com/foto30.1.pdf,https://arde-antiguo.s3-sa-east-1.amazonaws.com/foto31.pdf,https://arde-antiguo.s3-sa-east-1.amazonaws.com/foto31.1.pdf,https://arde-antiguo.s3-sa-east-1.amazonaws.com/foto32.pdf,https://arde-antiguo.s3-sa-east-1.amazonaws.com/foto32.1.pdf,https://arde-antiguo.s3-sa-east-1.amazonaws.com/foto33.pdf,https://arde-antiguo.s3-sa-east-1.amazonaws.com/foto33.1.pdf,https://arde-antiguo.s3-sa-east-1.amazonaws.com/foto34.pdf,https://arde-antiguo.s3-sa-east-1.amazonaws.com/foto34.1.pdf,https://arde-antiguo.s3-sa-east-1.amazonaws.com/foto35.pdf,https://arde-antiguo.s3-sa-east-1.amazonaws.com/foto35.1.pdf,https://arde-antiguo.s3-sa-east-1.amazonaws.com/foto36.pdf,https://arde-antiguo.s3-sa-east-1.amazonaws.com/foto36.1.pdf,https://arde-antiguo.s3-sa-east-1.amazonaws.com/foto37.pdf,https://arde-antiguo.s3-sa-east-1.amazonaws.com/foto37.1.pdf,https://arde-antiguo.s3-sa-east-1.amazonaws.com/foto38.pdf,https://arde-antiguo.s3-sa-east-1.amazonaws.com/foto38.1.pdf,https://arde-antiguo.s3-sa-east-1.amazonaws.com/foto39.pdf,https://arde-antiguo.s3-sa-east-1.amazonaws.com/foto39.1.pdf,https://arde-antiguo.s3-sa-east-1.amazonaws.com/foto40.pdf,https://arde-antiguo.s3-sa-east-1.amazonaws.com/foto41.pdf,https://arde-antiguo.s3-sa-east-1.amazonaws.com/foto42.pdf,https://arde-antiguo.s3-sa-east-1.amazonaws.com/foto43.pdf,https://arde-antiguo.s3-sa-east-1.amazonaws.com/foto43.1.pdf,https://arde-antiguo.s3-sa-east-1.amazonaws.com/foto44.pdf,https://arde-antiguo.s3-sa-east-1.amazonaws.com/foto45.pdf,https://arde-antiguo.s3-sa-east-1.amazonaws.com/foto46.pdf,https://arde-antiguo.s3-sa-east-1.amazonaws.com/foto47.pdf,https://arde-antiguo.s3-sa-east-1.amazonaws.com/foto48.pdf,https://arde-antiguo.s3-sa-east-1.amazonaws.com/foto49.pdf,https://arde-antiguo.s3-sa-east-1.amazonaws.com/foto49.1.pdf,https://arde-antiguo.s3-sa-east-1.amazonaws.com/foto50.pdf,https://arde-antiguo.s3-sa-east-1.amazonaws.com/foto50.1.pdf",Dataset,"Colectivo La Patogallina",1,0
4003,https://proyectoarde.org/items/show/4003,"Fotografía de montaje de Esperando al zurdo.","Esperando al zurdo de Clifford Odets","Fotografía En ella aparecen Gloria Canales y Eduardo ""Cacho"" Rodríguez representando una escena de la obra. ","Clifford Odets",,,"Sin información",Arde,"La propiedad intelectual de este documento pertenece a sus autoras y autores. Contáctal@s para su uso en hola@proyectoarde.cl",,JPEG,,Imagen,3d9979ff-476a-41cd-bb51-d0ffd6c0e436,,,,,,,,,,,,,,,,,,,,,,,,,,,,,,,,,,,,,,https://arde-antiguo.s3-sa-east-1.amazonaws.com/esperando-al-zurdo---gloria-y-cacho.jpg,Dataset,"Teatro del Pueblo",1,0
4004,https://proyectoarde.org/items/show/4004,"Fotografía de montaje de Esperando al zurdo.","Esperando al zurdo de Clifford Odets","Fotografía. En ella aparecen de izquierda a derecha: Víctor Calderón, abajo León Canales,  arriba no identificado junto a Horacio Muñoz, abajo sentado no identificado y en primer plano Eduardo ""Cacho"" Rodríguez. ","Clifford Odets",,,"Sin información",Arde,"La propiedad intelectual de este documento pertenece a sus autoras y autores. Contáctal@s para su uso en hola@proyectoarde.cl",,JPEG,,Imagen,d92b30fa-3abf-4c0c-ad4c-2b1fa49d3c5d,,,,,,,,,,,,,,,,,,,,,,,,,,,,,,,,,,,,,,https://arde-antiguo.s3-sa-east-1.amazonaws.com/esperando-al-zurdo.jpg,Dataset,"Teatro del Pueblo",1,0
4589,https://proyectoarde.org/items/show/4589,"Nota de prensa sobre <em>El amor es un buen negocio</em>","<em>El amor es un buen negocio</em>","Recorte de prensa en el que se reseña la obra <em>El amor es un buen negocio, </em>dirigido por Miguel Frank, y presentado en el Teatro El Túnel, en 1976. Vestuario y escenografía de Sergio Zapata.",Desconocido,"Archivo personal Sergio Zapata Brunet",,"Sin información","Rocío García","<span style=""font-weight:400;"">Esta obra está bajo una </span><a href=""http://creativecommons.org/licenses/by-nc/4.0/""><span style=""font-weight:400;"">Licencia Creative Commons Atribución-NoComercial 4.0 Internacional</span></a><span style=""font-weight:400;"">.</span>",,JPG,Español,"Still Image",,,,,,,,,,,,,,,,,,,,,,,,,,,,,,,,,,,,,,"Sergio Zapata","https://archivo-arde.s3-sa-east-1.amazonaws.com/SergioZapata2020/1 Derivado Uno, JPG/Portadoc. 04/143_TEATR_01.jpg",Dataset,"Sergio Zapata",1,0
4595,https://proyectoarde.org/items/show/4595,"Recortes de prensa sobre Sergio Zapata",,"Tres recortes de prensa, pegados sobre una cartulina azul, sobre Sergio Zapata. El de la esquina superior izquierda corresponde a una nota de La Segunda, acompañada de una fotografía y fechada el 6 de noviembre de 1986. El de la esquina superior izquierda es una fotografía en la que aparecen Jorge Marchant, Anita Reeves y Sergio Zapata. Abajo con letra manuscrita se lee: ""10-04-88 El Mercurio"". El de la esquina inferior derecha, es un papel blanco en el que se lee una nota y una fotografía del diseñador. ",Desconocido,"Archivo personal Sergio Zapata Brunet^^La Segunda^^El Mercurio",,"1986^^1988^^Sin información","Rocío García","<span style=""font-weight:400;"">Esta obra está bajo una </span><a href=""http://creativecommons.org/licenses/by-nc/4.0/""><span style=""font-weight:400;"">Licencia Creative Commons Atribución-NoComercial 4.0 Internacional</span></a><span style=""font-weight:400;"">.</span>",,JPG,Español,"Still Image",,,,,,,,,,,,,,,,,,,,,,,,,,,,,,,,,,,,,,"Sergio Zapata","https://archivo-arde.s3-sa-east-1.amazonaws.com/SergioZapata2020/1 Derivado Uno, JPG/Portadoc. 04/1424_DOCPE_01.jpg",Dataset,"Sergio Zapata",1,0
4609,https://proyectoarde.org/items/show/4609,"Cuaderno de trabajo de Eduardo Moya","Eduardo Moya.","Libreta con anotaciones, dibujos estudios de vestuario,  de utilería, escenografía y notas de El Húsar de la Muerte.","Eduardo Moya",,,"Sin información",Arde,"La propiedad intelectual de este documento pertenece a sus autoras y autores. Contáctal@s para su uso.",,JPEG,,dataset,8f99f455-4069-4cb7-944a-1d307ff0a982,,,,,,,,,,,,,,,,,,,,,,,,,,,,,,,,,,,,,,"https://arde-antiguo.s3-sa-east-1.amazonaws.com/0001.jpg,https://arde-antiguo.s3-sa-east-1.amazonaws.com/0002.jpg,https://arde-antiguo.s3-sa-east-1.amazonaws.com/0003.jpg,https://arde-antiguo.s3-sa-east-1.amazonaws.com/0004.jpg,https://arde-antiguo.s3-sa-east-1.amazonaws.com/0011.jpg,https://arde-antiguo.s3-sa-east-1.amazonaws.com/0005.jpg,https://arde-antiguo.s3-sa-east-1.amazonaws.com/0006.jpg,https://arde-antiguo.s3-sa-east-1.amazonaws.com/0007.jpg,https://arde-antiguo.s3-sa-east-1.amazonaws.com/0012.jpg,https://arde-antiguo.s3-sa-east-1.amazonaws.com/0013.jpg,https://arde-antiguo.s3-sa-east-1.amazonaws.com/0014.jpg,https://arde-antiguo.s3-sa-east-1.amazonaws.com/0008.jpg,https://arde-antiguo.s3-sa-east-1.amazonaws.com/0009.jpg,https://arde-antiguo.s3-sa-east-1.amazonaws.com/0010.jpg,https://arde-antiguo.s3-sa-east-1.amazonaws.com/0015.jpg,https://arde-antiguo.s3-sa-east-1.amazonaws.com/0016.jpg,https://arde-antiguo.s3-sa-east-1.amazonaws.com/0017.jpg,https://arde-antiguo.s3-sa-east-1.amazonaws.com/0018.jpg,https://arde-antiguo.s3-sa-east-1.amazonaws.com/0019.jpg,https://arde-antiguo.s3-sa-east-1.amazonaws.com/0020.jpg,https://arde-antiguo.s3-sa-east-1.amazonaws.com/0021.jpg,https://arde-antiguo.s3-sa-east-1.amazonaws.com/0022.jpg,https://arde-antiguo.s3-sa-east-1.amazonaws.com/0023.jpg,https://arde-antiguo.s3-sa-east-1.amazonaws.com/0024.jpg,https://arde-antiguo.s3-sa-east-1.amazonaws.com/0025.jpg,https://arde-antiguo.s3-sa-east-1.amazonaws.com/0026.jpg,https://arde-antiguo.s3-sa-east-1.amazonaws.com/0027.jpg,https://arde-antiguo.s3-sa-east-1.amazonaws.com/0028.jpg,https://arde-antiguo.s3-sa-east-1.amazonaws.com/0029.jpg,https://arde-antiguo.s3-sa-east-1.amazonaws.com/0030.jpg,https://arde-antiguo.s3-sa-east-1.amazonaws.com/0031.jpg,https://arde-antiguo.s3-sa-east-1.amazonaws.com/0032.jpg,https://arde-antiguo.s3-sa-east-1.amazonaws.com/0033.jpg,https://arde-antiguo.s3-sa-east-1.amazonaws.com/0034.jpg,https://arde-antiguo.s3-sa-east-1.amazonaws.com/0039.jpg,https://arde-antiguo.s3-sa-east-1.amazonaws.com/0035.jpg,https://arde-antiguo.s3-sa-east-1.amazonaws.com/0036.jpg,https://arde-antiguo.s3-sa-east-1.amazonaws.com/0037.jpg,https://arde-antiguo.s3-sa-east-1.amazonaws.com/0038.jpg,https://arde-antiguo.s3-sa-east-1.amazonaws.com/0040.jpg",Dataset,"Colectivo La Patogallina",1,0
4709,https://proyectoarde.org/items/show/4709,"Cuaderno de trabajo de Eduardo Moya ","Cuaderno de trabajo de Eduardo Moya ","Tapa frontal block croquis Artel^^ bond 24^^ 100 hojas^^ 21 x 32 cms. Bastante buen estado^^ bordes gastados^^ un pedazo de scotch y algunos cortes y rayas.  ""Calendario de presentaciones con fecha^^ comuna y^^ en algunos casos^^ hora. Dibujos^^ estudio de utilería. Estudio de _El Húsar de la Muerte_ y logo. Apuntes varios. "" Boceto logo de La Patogallina. Boceto del logo de La Patogallina. Dibujos varios. Estudio de vestuario para 1907 El año de la flor negra. Dibujos de insectos. Estudios de vestuario^^ escenografía y utilería para 1907 El año de la flor negra. Dibujo de logo. Fechas y lugares de presentaciones. Boceto logo  ""2001 Gira de película"" _La Patogallina Colectivo Artístico_.  Tapa posterior del block croquis Artel.","Eduardo Moya",,,"Sin información",Arde,"La propiedad intelectual de este documento pertenece a sus autoras y autores. Contáctal@s para su uso.",,JPEG,,dataset,a51e877c-4711-44bf-9be6-831674ed5a7b,,,,,,,,,,,,,,,,,,,,,,,,,,,,,,,,,,,,,,https://s3.sa-east-1.amazonaws.com/ardeomeka/original/3cf9500773d35e0094b6a568b9142f10.jpg?AWSAccessKeyId=AKIA2OVYM46UCGCAAWEM&Expires=1716078000&Signature=KixvSS14GNqBMGjhz92%2BrUtZ8Lw%3D,Dataset,"Colectivo La Patogallina",1,0
4006,https://proyectoarde.org/items/show/4006,"Programa de Chinchilote","Chinchilote de Eduardo ""Lalo"" Pérez","Programa de ""Chinchilote"", obra teatral escrita por Eduardo ""Lalo"" Pérez y dirigida por María Maluenda y Horacio Muñoz. Este está compuesto por tres hojas mecanografiadas, a saber, la portada, la ficha técnica y un manifiesto por parte del autor.","Eduardo Pérez",,,"Sin información",Arde,"La propiedad intelectual de este documento pertenece a sus autoras y autores. Contáctal@s para su uso en hola@proyectoarde.cl",,JPEG,,Imagen,ad9d7a33-6b8d-4c7f-bd93-17197ba6c175,,,,,,,,,,,,,,,,,,,,,,,,,,,,,,,,,,,,,,"https://s3.sa-east-1.amazonaws.com/ardeomeka/original/ef23bf7a45c0f76551ae6fb244b9b73d.jpg?AWSAccessKeyId=AKIA2OVYM46UCGCAAWEM&Expires=1716078000&Signature=3aUYsizvHbBzhFsPw7n87uvC3xo%3D,https://arde-antiguo.s3-sa-east-1.amazonaws.com/chinchilote0002.jpg,https://s3.sa-east-1.amazonaws.com/ardeomeka/original/469295fcedc723b2891c030cef8ddd54.jpg?AWSAccessKeyId=AKIA2OVYM46UCGCAAWEM&Expires=1716078000&Signature=WsNzQT912e5Peyuo%2BohjjxwRuUs%3D",Dataset,"Teatro del Pueblo",1,0
6812,https://proyectoarde.org/items/show/6812,"Programa de la obra ""Jojo""","Artes escénicas, teatro de figuras, teatro contemporáneo","Programa de la obra ""Jojo"", Comedia Musical basada en la obra homónima de Michael Ende. Dirección de Jaime Schneider y asistencia de dirección de Marcela Cornejo. Obra realizada en el contexto de formación de estudiantes de la Escuela Teatro Imagen.","Jaime Schneider, dirección^^Marcela Cornejo, asistencia de dirección^^Estudiantes de la Escuela de Teatro Imagen","Archivo personal de Marcela Cornejo",ARDE,"Sin información","Constanza Alvarado","Esta obra está bajo una Licencia Creative Commons Atribución-NoComercial 4.0 Internacional",,PDF,Español,Texto,,"Santiago, Región Metropolitana, Chile",,,,,,,,,,,,,,,,,,,,,,,,,,,,,,,,,,,,,https://s3.sa-east-1.amazonaws.com/ardeomeka/original/3f372af6bfc1b403b4a8b3c535331ed0.pdf?AWSAccessKeyId=AKIA2OVYM46UCGCAAWEM&Expires=1716078000&Signature=hjnmOPOV%2B67MbdAIHIZPATO0VM0%3D,,"Marcela Cornejo Gómez",1,0
3977,https://proyectoarde.org/items/show/3977,"Entrevista a Lelia Céspedes","Entrevistas Teatro del Pueblo","Entrevista realizada el 28 de agosto de 2017 a la integrante Lelia Céspedes. En ella se refiere a su experiencia en el Teatro del Pueblo durante los primeros años de la década de 1960.","Javiera Brignardello",,,"Sin información",Arde,"La propiedad intelectual de este documento pertenece a sus autoras y autores. Contáctal@s para su uso en hola@proyectoarde.cl",,MP3,,Audio,2206eb79-2831-42eb-8a6c-8bf9141c5515,,,,,,,,,,,,,,,,,,,,,,,,,,,,,,,,,,,,,,"https://s3.sa-east-1.amazonaws.com/ardeomeka/original/02b63894eea485ab8d7b24e11750da87.png?AWSAccessKeyId=AKIA2OVYM46UCGCAAWEM&Expires=1716078000&Signature=oCEo79n%2BBA9BQV0sw5OJP4uslbA%3D,https://arde-antiguo.s3-sa-east-1.amazonaws.com/teatrodelpueblo-entrevistaleliacspedescarl.mp3",Dataset,"Teatro del Pueblo",1,0
5950,https://proyectoarde.org/items/show/5950,"Planos para <em>La cocina pública</em>","<em>La cocina pública, </em>Teatro Container","Planos para el montaje de <em>La cocina pública</em>^^Material recopilado por Kevin Morizur a partir del  Proyecto “Huellas de creación” que busca investigar y difundir los procesos de creación de compañías de teatro chilenas contemporáneas.","Kevin Morizur","Teatro Container",ARDE,"Sin información","<em>La cocina pública</em>^^Pía Gutiérrez","Creative Commons CC BY Atribución/Reconocimiento","Sin información",JPG,"Sin información",imagen,"Sin información","Sin información",,,,,,,,,,,,,,,,,,,,,,,,,,,,,,,,,,,,"Artes escénicas,La Cocina Pública,Teatro chileno contemporáneo","https://archivo-arde.s3-sa-east-1.amazonaws.com/Cocina Pública_Container/Kevin/cocina_plan1.jpg",Dataset,"<em>La cocina pública </em>de Teatro Container",1,0
4600,https://proyectoarde.org/items/show/4600,"Volante Karrocerías ","Afiches^^ volantes y programas en pequeño formato","Volante de una presentación de Karrocerías","La Patogallina",,,"Sin información",Arde,"La propiedad intelectual de este documento pertenece a sus autoras y autores. Contáctal@s para su uso.",,PDF,,dataset,5251e2ab-61b3-4008-ac0f-d79b73ac8007,,,,,,,,,,,,,,,,,,,,,,,,,,,,,,,,,,,,,,"https://arde-antiguo.s3-sa-east-1.amazonaws.com/afiches109.pdf,https://arde-antiguo.s3-sa-east-1.amazonaws.com/afiches110.pdf",Dataset,"Colectivo La Patogallina",1,0
